{"text_format":"1","workbook":"xlsx","n_sheets":13,"sheets":["Welcome","Dashboard","Feedstock","Upstream","Pellet plant","Pellet transport","End use","Standard values","Reference values","Emissions","Assisting calculations","References","Version history"],"not_rendered":{"charts":1,"images":16,"macros":1,"external_links":0,"defined_names":166,"comments":0,"pivot_tables":0},"unopened":[],"bounds":{"document_bytes":16777216,"sheet_cells":100000,"rows_first":2000,"rows_last":500,"rows_between":2000,"halvings":0,"cell_chars":16384,"cell_head_chars":4096},"cells_cut":0,"cells_raw":0,"read":"whole","date_system":"1900"}

{"sheet":"Welcome","index":0,"n_rows":12,"n_cols":2,"rows_kept":12,"cut":false,"hidden":false,"merged":[[9,1,9,16],[11,1,11,16]]}
[]
[]
[]
[]
[]
[]
[null,"Biomass Carbon Calculator"]
[]
[]
[null,"The ‘Biomass Carbon Calculator’ is a greenhouse gas (GHG) lifecycle emission tool developed by Drax for the purpose of calculating wood pellet supply chain GHG emissions in accordance with UK and EU regulatory requirements. The Calculator has been independently verified against the Renewables Obligation Order 2015 for England and Wales (as amended) and Directive (EU) 2018/2001 of the European Parliament and of the Council of 11 December 2018 on the promotion of the use of energy from renewable sources. Verification statements are available on the Drax website.\n\nThe Calculator is appropriate for modelling supply chain emissions for most wood pellet supply chains, including wood pellet from forestry products, forestry residues, industrial processing residues and wood waste."]
{"$rows_left_out":3}
{"sheet":"Dashboard","index":1,"n_rows":61,"n_cols":14,"rows_kept":61,"cut":false,"hidden":false,"merged":[[51,9,51,10],[2,7,2,8],[3,7,3,8],[28,5,28,10],[28,11,28,13],[28,1,28,4],[2,5,2,6],[3,5,3,6],[1,5,1,8],[4,5,4,6],[4,7,4,8],[1,2,1,3],[10,1,10,3]]}
[null,null,null,null,null,null,null,null,null,null,null,"Key"]
[null,null,"Reporting Information",null,null,"Transport Route Selections",null,null,null,null,null,"Input"]
[null,null,"Pellet plant",null,null,"Feedstock travel distance",null,null,null,null,null,"Calculation"]
[null,null,"Start of period",null,null,"Route identifier",null,null,null,null,null,"Information"]
[null,null,"End of period",null,null,"Route definition",null,{"$f":"IFERROR(INDEX(Route_definitions,MATCH(Route_selector,Routes,0)),\"\")","v":""},null,null,null,"Pulled data"]
[]
[]
[null,"End User"]
[]
[]
{"$rows_left_out":52}
{"sheet":"Feedstock","index":2,"n_rows":34,"n_cols":14,"rows_kept":34,"cut":false,"hidden":false,"merged":[[40,1,40,9],[41,1,41,9],[42,1,42,9],[43,1,43,9],[37,1,37,9],[39,1,39,9],[38,1,38,9],[34,1,34,9],[35,1,35,9],[36,1,36,9],[33,1,33,9],[29,1,29,2],[30,1,30,2],[31,1,31,9],[32,1,32,9]]}
[null,null,null,null,null,null,null,null,null,"Key"]
[null,null,null,null,null,null,null,null,null,"Input"]
[null,null,null,null,null,null,null,null,null,"Calculation"]
[null,null,null,null,null,null,null,null,null,"Information"]
[null,null,null,null,null,null,null,null,null,"Pulled data"]
[]
[]
[null,"Consignment #","Feedstock group","Origin","Country","Physical description","Tonnes processed\ntfeedstock\nfresh matter*","Moisture\n%\nas received","Drying required at pellet plant","Moisture\n%\ndryer inlet**",null,null,"Verified","Auditor comments"]
[null,1]
[null,2]
{"$rows_left_out":25}
{"sheet":"Upstream","index":3,"n_rows":51,"n_cols":25,"rows_kept":51,"cut":false,"hidden":false,"merged":[[36,6,37,6],[38,6,39,6],[40,6,41,6],[42,6,43,6],[44,6,45,6],[46,6,47,6],[3,2,4,3],[18,6,19,6],[20,6,21,6],[22,6,23,6],[24,6,25,6],[26,6,27,6],[28,6,29,6],[30,6,31,6],[32,6,33,6],[34,6,35,6],[8,6,9,6],[10,6,11,6],[12,6,13,6],[14,6,15,6],[16,6,17,6],[28,4,29,4],[28,5,29,5],[46,1,47,1],[46,2,47,2],[46,3,47,3],[46,4,47,4],[46,5,47,5],[44,1,45,1],[44,2,45,2],[44,3,45,3],[44,4,45,4],[44,5,45,5],[42,1,43,1],[42,2,43,2],[42,3,43,3],[42,4,43,4],[42,5,43,5],[40,1,41,1],[40,2,41,2],[40,3,41,3],[40,4,41,4],[40,5,41,5],[38,1,39,1],[38,2,39,2],[38,3,39,3],[38,4,39,4],[38,5,39,5],[36,1,37,1],[36,2,37,2],[36,3,37,3],[36,4,37,4],[36,5,37,5],[49,1,49,11],[18,5,19,5],[20,5,21,5],[22,5,23,5],[24,5,25,5],[26,5,27,5],[26,1,27,1],[26,3,27,3],[26,2,27,2],[24,4,25,4],[26,4,27,4],[24,3,25,3],[24,2,25,2],[24,1,25,1],[20,1,21,1],[32,2,33,2],[32,3,33,3],[32,4,33,4],[32,5,33,5],[34,1,35,1],[34,2,35,2],[34,3,35,3],[34,4,35,4],[34,5,35,5],[30,1,31,1],[30,2,31,2],[30,3,31,3],[30,4,31,4],[30,5,31,5],[32,1,33,1],[16,5,17,5],[16,1,17,1],[16,3,17,3],[16,2,17,2],[18,1,19,1],[18,3,19,3],[18,2,19,2],[60,1,60,11],[16,4,17,4],[18,4,19,4],[20,4,21,4],[22,4,23,4],[55,1,55,11],[50,1,50,11],[51,1,51,11],[52,1,52,11],[53,1,53,11],[54,1,54,11],[48,1,48,11],[20,2,21,2],[22,1,23,1],[22,3,23,3],[22,2,23,2],[56,1,56,11],[57,1,57,11],[58,1,58,11],[59,1,59,11],[20,3,21,3],[28,1,29,1],[28,2,29,2],[28,3,29,3],[1,20,1,24],[4,20,4,23],[2,24,3,24],[10,1,11,1],[4,14,4,15],[14,2,15,2],[14,3,15,3],[12,4,13,4],[14,4,15,4],[8,5,9,5],[10,5,11,5],[12,5,13,5],[14,5,15,5],[14,1,15,1],[13,15,13,18],[14,15,14,18],[15,15,15,18],[12,1,13,1],[12,3,13,3],[12,2,13,2],[8,1,9,1],[8,3,9,3],[2,20,3,23],[1,2,2,3],[1,14,1,18],[7,15,7,18],[8,15,8,18],[9,15,9,18],[10,15,10,18],[11,15,11,18],[12,15,12,18],[8,2,9,2],[10,2,11,2],[10,3,11,3],[2,14,3,15],[8,4,9,4],[10,4,11,4],[2,16,3,16],[16,15,16,18],[17,15,17,18],[18,15,18,18],[19,15,19,18],[20,15,20,18],[21,15,21,18],[2,18,3,18],[2,17,3,17],[22,15,22,18],[23,15,23,18],[24,15,24,18],[25,15,25,18],[26,15,26,18],[27,15,27,18],[28,15,28,18],[29,15,29,18],[30,15,30,18],[31,15,31,18],[32,15,32,18],[33,15,33,18],[34,15,34,18],[35,15,35,18],[36,15,36,18],[37,15,37,18],[38,15,38,18],[39,15,39,18],[40,15,40,18],[41,15,41,18],[42,15,42,18],[55,15,55,18],[56,15,56,18],[57,15,57,18],[58,15,58,18],[59,15,59,18],[60,15,60,18],[50,15,50,18],[43,15,43,18],[44,15,44,18],[45,15,45,18],[46,15,46,18],[47,15,47,18],[51,15,51,18],[52,15,52,18],[53,15,53,18],[54,15,54,18]]}
[null,null,null,null,null,null,null,null,null,null,null,"Key"]
[null,null,"Use actual or disaggregated default values for harvesting and cultivation",null,null,null,null,null,null,null,null,"Input",null,null,"Diesel use lookup",null,null,null,null,null,"Disaggregated default value looklup"]
[null,null,null,null,null,null,null,null,null,null,null,"Calculation",null,null,"Process",null,"Diesel use l/toutput\ndry matter","Consignment","Diesel use l/toutput\nfresh matter",null,"Feedstock",null,null,null,"Emissions\ngCO2eq/MJpellet"]
[null,null,"Actual values",null,null,null,null,null,null,null,null,"Information"]
[null,null,null,null,null,null,null,null,null,null,null,"Pulled data",null,null,null,null,{"$f":"IFERROR(INDEX(Upstream_typicals,MATCH(O5,Upstream_process,0)),\"\")","v":""},null,{"$f":"IFERROR($Q$5*(1-INDEX(Feedstock_table[Moisture\n%\nas received],MATCH($R$5,Feedstock_table[Consignment '#],0))),\"\")","v":""},null,null,null,null,null,{"$f":"IFERROR(INDEX(Disaggregated_defaults,MATCH(U5,Feedstock_for_defaults,0)),\"\")","v":""}]
[null,null,null,null,null,null,null,null,null,null,null,null,null,null,"N.B. Typical values must be adjusted to a fresh matter basis by multiplying by the dry matter content of the feedstock (i.e. 100% - moisture content) "]
[]
[null,"Feedstock group","Origin","Consignment #","Diesel use\nl/toutput\nfresh matter*","Additional upstream emissions\nkgCO2eq/toutput\nfresh matter**","Disaggregated default value\ngCO2eq/MJpellet","Journey","Transport mode","Transport fuel","Weighted average distance to mill\nkm","Maximum distance to mill\nkm",null,null,"Verified","Auditor comments"]
[null,{"$f":"IF(ISBLANK(Feedstock!C9),\"\",Feedstock!C9)","v":""},{"$f":"IF(ISBLANK(Feedstock!D9),\"\",Feedstock!D9)","v":""},{"$f":"IF(ISBLANK(Feedstock!B9),\"\",Feedstock!B9)","v":1}]
[]
{"$rows_left_out":42}
{"sheet":"Pellet plant","index":4,"n_rows":136,"n_cols":13,"rows_kept":136,"cut":false,"hidden":false,"merged":[[21,1,21,3],[32,1,32,3],[37,1,37,2],[93,1,93,2],[47,1,47,4],[26,1,26,2],[67,1,67,2],[73,1,73,4],[59,1,59,4],[85,1,85,4],[60,1,60,2],[61,1,61,2],[62,1,62,2],[88,1,88,2],[89,1,89,2],[90,1,90,2],[91,1,91,2],[63,1,63,2],[64,1,64,2],[65,1,65,2],[86,1,86,2],[87,1,87,2],[8,9,8,12],[9,9,9,12],[10,9,10,12],[11,9,11,12],[12,9,12,12],[140,1,140,5],[127,1,127,2],[1,8,1,12],[3,8,4,8],[3,9,4,9],[121,1,121,3],[116,1,116,5],[3,10,4,10],[135,1,135,5],[136,1,136,5],[137,1,137,5],[138,1,138,5],[139,1,139,5],[105,1,105,2],[109,1,109,2],[7,1,7,5],[14,1,14,5],[103,1,103,5],[28,9,28,12],[33,9,33,12],[34,9,34,12],[22,9,22,12],[23,9,23,12],[24,9,24,12],[26,9,26,12],[27,9,27,12],[30,9,30,12],[42,9,42,12],[29,9,29,12],[48,9,48,12],[49,9,49,12],[50,9,50,12],[51,9,51,12],[43,9,43,12],[44,9,44,12],[45,9,45,12],[35,9,35,12],[37,9,37,12],[38,9,38,12],[39,9,39,12],[40,9,40,12],[41,9,41,12],[52,9,52,12],[60,9,60,12],[61,9,61,12],[62,9,62,12],[63,9,63,12],[53,9,53,12],[54,9,54,12],[55,9,55,12],[56,9,56,12],[57,9,57,12],[58,9,58,12],[74,9,74,12],[75,9,75,12],[76,9,76,12],[77,9,77,12],[86,9,86,12],[97,9,97,12],[64,9,64,12],[67,9,67,12],[68,9,68,12],[69,9,69,12],[70,9,70,12],[65,9,65,12],[83,9,83,12],[84,9,84,12],[81,9,81,12],[90,9,90,12],[91,9,91,12],[87,9,87,12],[88,9,88,12],[89,9,89,12],[93,9,93,12],[94,9,94,12],[71,9,71,12],[118,9,118,12],[137,9,137,12],[138,9,138,12],[139,9,139,12],[140,9,140,12],[132,9,132,12],[133,9,133,12],[129,9,129,12],[130,9,130,12],[131,9,131,12],[135,9,135,12],[136,9,136,12],[119,9,119,12],[98,3,98,5],[42,3,42,5],[122,9,122,12],[123,9,123,12],[124,9,124,12],[125,9,125,12],[128,9,128,12],[112,9,112,12],[113,9,113,12],[114,9,114,12],[78,9,78,12],[79,9,79,12],[80,9,80,12],[82,9,82,12],[111,9,111,12],[98,9,98,12],[99,9,99,12],[100,9,100,12],[101,9,101,12],[95,9,95,12],[96,9,96,12],[106,9,106,12],[107,9,107,12],[110,9,110,12]]}
[null,null,null,null,null,"Key"]
[null,null,null,null,null,"Input",null,null,"Unit converter"]
[null,null,null,null,null,"Calculation",null,null,"Fuel","Input value","Input unit","Output value","Output unit"]
[null,null,null,null,null,"Information",null,null,null,null,null,{"$f":"IFERROR(IF(Converter_input_unit=\"kg\",Converter_input_value,IF(Converter_input_unit=\"tonne\",Converter_input_value*kgpert,IF(Converter_input_unit=\"litre\",Converter_input_value/lperm3*INDEX(Fossil_fuel_density,MATCH(Converter_fuel,Fossil_fuels,0)),IF(Converter_input_unit=\"m3\",Converter_input_value*INDEX(Fossil_fuel_density,MATCH(Converter_fuel,Fossil_fuels,0)),IF(Converter_input_unit=\"MJ\",Converter_input_value/INDEX(Fossil_fuel_LHV,MATCH(Converter_fuel,Fossil_fuels,0)),IF(Converter_input_unit=\"GJ\",Converter_input_value/INDEX(Fossil_fuel_LHV,MATCH(Converter_fuel,Fossil_fuels,0))*MJperGJ,IF(Converter_input_unit=\"kWh\",Converter_input_value*MJperkWh/INDEX(Fossil_fuel_LHV,MATCH(Converter_fuel,Fossil_fuels,0)),IF(Converter_input_unit=\"MWh\",Converter_input_value*MJperMWh/INDEX(Fossil_fuel_LHV,MATCH(Converter_fuel,Fossil_fuels,0)),IF(Converter_input_unit=\"mmbtu\",Converter_input_value*MJpermmBTU/INDEX(Fossil_fuel_LHV,MATCH(Converter_fuel,Fossil_fuels,0)),\"\"))))))))),\"N/A\")","v":""},"kg"]
[null,null,null,null,null,"Pulled data",null,null,null,null,null,{"$f":"IFERROR(IF(Converter_input_unit=\"kg\",Converter_input_value*INDEX(Fossil_fuel_LHV,MATCH(Converter_fuel,Fossil_fuels,0)),IF(Converter_input_unit=\"tonne\",Converter_input_value*kgpert*INDEX(Fossil_fuel_LHV,MATCH(Converter_fuel,Fossil_fuels,0)),IF(Converter_input_unit=\"litre\",Converter_input_value*INDEX(Fossil_fuel_density,MATCH(Converter_fuel,Fossil_fuels,0))/lperm3*INDEX(Fossil_fuel_LHV,MATCH(Converter_fuel,Fossil_fuels,0)),IF(Converter_input_unit=\"m3\",Converter_input_value*INDEX(Fossil_fuel_density,MATCH(Converter_fuel,Fossil_fuels,0))*INDEX(Fossil_fuel_LHV,MATCH(Converter_fuel,Fossil_fuels,0)),(IF(Converter_input_unit=\"MJ\",Converter_input_value,IF(Converter_input_unit=\"GJ\",Converter_input_value*kgpert,IF(Converter_input_unit=\"kWh\",Converter_input_value*MJperkWh,IF(Converter_input_unit=\"kWh\",Converter_input_value*MJperkWh,IF(Converter_input_unit=\"MWh\",Converter_input_value*MJperMWh,IF(Converter_input_unit=\"mmbtu\",Converter_input_value*MJpermmBTU,\"\"))))))))))),\"N/A\")","v":""},"MJ"]
[]
[]
[null,"Pellet plant output"]
[null,null,null,null,null,null,null,null,"Verified","Auditor comments"]
[null,"Total pellet output tfresh matter"]
{"$rows_left_out":127}
{"sheet":"Pellet transport","index":5,"n_rows":212,"n_cols":11,"rows_kept":212,"cut":false,"hidden":false,"merged":[[220,1,220,4],[40,1,40,4],[59,1,59,4],[78,1,78,4],[97,1,97,4],[116,1,116,4],[92,1,92,3],[9,1,9,2],[10,1,10,2],[11,1,11,2],[30,1,30,2],[21,1,21,4],[206,1,206,3],[125,1,125,2],[130,1,130,3],[144,1,144,2],[149,1,149,3],[163,1,163,2],[135,1,135,4],[154,1,154,4],[173,1,173,4],[192,1,192,4],[168,1,168,3],[182,1,182,2],[221,1,221,4],[1,7,1,10],[214,1,214,4],[215,1,215,4],[216,1,216,4],[211,1,211,4],[212,1,212,4],[213,1,213,4],[12,1,12,2],[13,1,13,2],[14,1,14,2],[15,1,15,2],[16,1,16,2],[17,1,17,2],[18,1,18,2],[19,1,19,2],[218,1,218,4],[219,1,219,4],[7,1,7,2],[35,1,35,3],[217,1,217,4],[106,1,106,2],[111,1,111,3],[201,1,201,2],[187,1,187,3],[49,1,49,2],[54,1,54,3],[68,1,68,2],[73,1,73,3],[87,1,87,2],[14,8,14,10],[15,8,15,10],[16,8,16,10],[17,8,17,10],[18,8,18,10],[32,8,32,10],[42,8,42,10],[43,8,43,10],[44,8,44,10],[45,8,45,10],[46,8,46,10],[33,8,33,10],[36,8,36,10],[37,8,37,10],[38,8,38,10],[41,8,41,10],[56,8,56,10],[57,8,57,10],[9,8,9,10],[10,8,10,10],[11,8,11,10],[12,8,12,10],[13,8,13,10],[26,8,26,10],[27,8,27,10],[28,8,28,10],[31,8,31,10],[19,8,19,10],[22,8,22,10],[23,8,23,10],[24,8,24,10],[25,8,25,10],[60,8,60,10],[61,8,61,10],[62,8,62,10],[47,8,47,10],[50,8,50,10],[51,8,51,10],[52,8,52,10],[55,8,55,10],[70,8,70,10],[71,8,71,10],[74,8,74,10],[75,8,75,10],[76,8,76,10],[63,8,63,10],[64,8,64,10],[65,8,65,10],[66,8,66,10],[69,8,69,10],[84,8,84,10],[85,8,85,10],[88,8,88,10],[89,8,89,10],[90,8,90,10],[79,8,79,10],[80,8,80,10],[81,8,81,10],[82,8,82,10],[83,8,83,10],[100,8,100,10],[101,8,101,10],[102,8,102,10],[103,8,103,10],[104,8,104,10],[93,8,93,10],[94,8,94,10],[95,8,95,10],[98,8,98,10],[99,8,99,10],[114,8,114,10],[117,8,117,10],[118,8,118,10],[119,8,119,10],[120,8,120,10],[107,8,107,10],[108,8,108,10],[109,8,109,10],[112,8,112,10],[113,8,113,10],[128,8,128,10],[131,8,131,10],[132,8,132,10],[133,8,133,10],[136,8,136,10],[121,8,121,10],[122,8,122,10],[123,8,123,10],[126,8,126,10],[127,8,127,10],[142,8,142,10],[145,8,145,10],[146,8,146,10],[147,8,147,10],[150,8,150,10],[137,8,137,10],[138,8,138,10],[139,8,139,10],[140,8,140,10],[141,8,141,10],[158,8,158,10],[159,8,159,10],[160,8,160,10],[161,8,161,10],[164,8,164,10],[151,8,151,10],[152,8,152,10],[155,8,155,10],[156,8,156,10],[157,8,157,10],[174,8,174,10],[175,8,175,10],[176,8,176,10],[177,8,177,10],[178,8,178,10],[165,8,165,10],[166,8,166,10],[169,8,169,10],[170,8,170,10],[171,8,171,10],[188,8,188,10],[189,8,189,10],[190,8,190,10],[193,8,193,10],[194,8,194,10],[179,8,179,10],[180,8,180,10],[183,8,183,10],[184,8,184,10],[185,8,185,10],[202,8,202,10],[203,8,203,10],[204,8,204,10],[207,8,207,10],[208,8,208,10],[195,8,195,10],[196,8,196,10],[197,8,197,10],[198,8,198,10],[199,8,199,10],[220,8,220,10],[221,8,221,10],[215,8,215,10],[216,8,216,10],[217,8,217,10],[218,8,218,10],[219,8,219,10],[209,8,209,10],[211,8,211,10],[212,8,212,10],[213,8,213,10],[214,8,214,10]]}
[null,null,null,null,"Key"]
[null,null,null,null,"Input",null,null,"Unit converter"]
[null,null,null,null,"Calculation",null,null,"Input value","Input unit","Output value","Output unit"]
[null,null,null,null,"Information",null,null,null,null,{"$f":"IF(I4=\"miles\",H4*kmpermile,IF(I4=\"nautical miles\",H4*kmpernauticalmile,\"\"))","v":""},"km"]
[null,null,null,null,"Pulled data"]
[]
[]
[null,"Number of route identifiers"]
[]
[null,"Route definition",null,"Route identifier",null,null,null,"Verified","Auditor comments"]
{"$rows_left_out":203}
{"sheet":"End use","index":6,"n_rows":15,"n_cols":8,"rows_kept":15,"cut":false,"hidden":false,"merged":[[14,1,14,2],[15,1,15,2]]}
[null,null,null,"Key"]
[null,null,null,"Input"]
[null,null,null,"Calculation"]
[null,null,null,"Information"]
[null,null,null,"Pulled data"]
[]
[]
[null,null,null,null,null,null,"Verified","Comments"]
[null,"Fuel type","Wood pellet"]
[null,"Non-combustion CO2 emissions gCO2eq/MJfuel",{"$f":"IFERROR(INDEX(Non_CO2_fuel_use_emissions,MATCH(Final_fuel,Final_fuels,0)),\"\")","v":0.3}]
{"$rows_left_out":6}
{"sheet":"Standard values","index":7,"n_rows":370,"n_cols":12,"rows_kept":370,"cut":false,"hidden":false,"merged":[[226,1,226,7],[79,1,79,7],[91,1,91,7],[199,11,199,15],[200,11,200,15],[215,11,215,15],[216,11,216,15],[217,11,217,15],[224,11,224,15],[225,11,225,15],[218,11,218,15],[219,11,219,15],[220,11,220,15],[221,1,221,7],[103,1,103,7],[203,1,203,7],[47,11,47,15],[48,11,48,15],[49,11,49,15],[13,1,13,2],[110,1,110,7],[34,11,34,15],[35,11,35,15],[61,11,61,15],[62,11,62,15],[63,11,63,15],[71,11,71,15],[72,11,72,15],[50,11,50,15],[60,11,60,15],[36,11,36,15],[37,11,37,15],[186,1,186,7],[7,1,7,2],[65,1,65,7],[25,1,25,7],[173,1,173,7],[166,1,166,7],[39,1,39,7],[52,1,52,7],[231,11,231,15],[232,11,232,15],[106,11,106,15],[107,11,107,15],[108,11,108,15],[151,11,151,15],[152,11,152,15],[153,11,153,15],[171,11,171,15],[172,11,172,15],[173,11,173,15],[183,11,183,15],[166,11,166,15],[184,11,184,15],[185,11,185,15],[198,11,198,15],[226,11,226,15],[229,11,229,15],[230,11,230,15],[73,11,73,15],[74,11,74,15],[221,11,221,15],[201,11,201,15],[202,11,202,15],[203,11,203,15],[186,11,186,15],[164,11,164,15],[165,11,165,15],[100,11,100,15],[101,11,101,15],[88,11,88,15],[89,11,89,15],[159,11,159,15],[160,11,160,15],[161,11,161,15],[162,11,162,15],[163,11,163,15],[154,11,154,15],[155,11,155,15],[156,11,156,15],[157,11,157,15],[158,11,158,15],[75,11,75,15],[76,11,76,15],[98,11,98,15],[99,11,99,15],[84,11,84,15],[85,11,85,15],[86,11,86,15],[87,11,87,15],[96,11,96,15],[97,11,97,15]]}
[null,null,"Key"]
[null,null,"Input"]
[null,null,"Calculation"]
[null,null,"Information"]
[null,null,"Pulled data"]
[]
[]
[null,"Global warming potentials"]
[null,"Gas","GWP\ngCO2eq/g"]
[null,"CO2",1]
{"$rows_left_out":361}
{"sheet":"Reference values","index":8,"n_rows":54,"n_cols":10,"rows_kept":54,"cut":false,"hidden":false,"merged":[[7,1,7,5],[53,9,53,11],[47,9,47,11],[48,9,48,11],[49,9,49,11],[50,9,50,11],[51,9,51,11],[52,9,52,11],[46,9,46,11],[23,1,23,5],[31,1,31,5],[37,1,37,5],[42,1,42,5],[43,9,43,11],[44,9,44,11],[45,9,45,11]]}
[null,null,"Key"]
[null,null,"Input"]
[null,null,"Calculation"]
[null,null,"Information"]
[null,null,"Pulled data"]
[]
[]
[null,"RED disaggregated default values for cultivation and harvesting"]
[null,"Feedstock","Emissions\ngCO2eq/MJ","[NA.]","Reference","Notes"]
[null,"Wood pellet from forest residues ",0,null,5]
{"$rows_left_out":45}
{"sheet":"Emissions","index":9,"n_rows":137,"n_cols":65,"rows_kept":137,"cut":false,"hidden":false,"merged":[[134,1,136,1],[121,1,132,1],[108,6,108,8],[117,6,117,7],[80,1,119,1],[101,6,101,8],[89,6,89,7],[80,6,80,8],[106,6,106,7],[87,6,87,7],[115,6,115,7],[97,6,97,8],[11,26,11,31],[34,3,34,4],[57,3,57,4],[11,1,32,1],[34,1,55,1],[57,1,78,1],[57,44,57,58],[80,44,80,54],[57,20,57,29],[5,3,5,4],[34,20,34,24],[11,3,11,4],[34,43,34,47],[34,27,34,34],[34,35,34,42],[11,20,11,25],[34,6,34,17],[5,6,5,17],[34,25,34,26],[9,20,9,22],[8,20,8,22],[7,20,7,22],[5,20,5,64],[134,20,134,26],[121,51,121,54],[121,55,121,64],[121,6,121,15],[121,21,121,25],[134,6,134,7],[121,36,121,40],[121,46,121,50],[121,26,121,30],[121,41,121,45],[121,31,121,35],[89,44,89,55],[57,6,57,9],[57,31,57,42],[80,31,80,38]]}
[]
[]
[]
[]
[]
[null,null,null,"Consignment",null,null,"Emissions",null,null,null,null,null,null,null,null,null,null,null,null,null,"Supporting calculations"]
[]
[null,null,null,null,null,null,null,null,null,null,null,null,null,null,null,null,null,null,null,null,"Total pellet output tdry matter",null,null,{"$f":"Pellet_tonnes*(1-Pellet_moisture)","v":0}]
[null,null,null,null,null,null,null,null,null,null,null,null,null,null,null,null,null,null,null,null,"Pellet LHV MJ/kgdry matter",null,null,{"$f":"(Pellet_lhv+Pellet_moisture*2.441)/(1-Pellet_moisture)","v":0}]
[null,null,null,null,null,null,null,null,null,null,null,null,null,null,null,null,null,null,null,null,"Processing feedstock factor MJfeedstock/MJpellet",null,null,{"$f":"IFERROR(SUM(Mass_balance_table[Consignment input\nMJfeedstock\ndry matter])/SUM(Mass_balance_table[Consignment output\nMJpellet\ndry matter]),\"\")","v":""}]
{"$rows_left_out":128}
{"sheet":"Assisting calculations","index":10,"n_rows":42,"n_cols":15,"rows_kept":42,"cut":false,"hidden":false,"merged":[[7,8,7,14],[21,1,21,2],[21,5,21,6],[31,1,31,2],[31,5,31,6],[7,1,7,6],[12,14,13,14],[9,8,9,9],[10,8,10,9],[12,12,13,12],[12,13,13,13],[12,8,13,8],[12,9,13,9],[12,10,13,10],[12,11,13,11],[33,10,35,10],[33,9,35,9],[33,11,35,11],[33,8,35,8],[26,8,26,13],[27,8,30,8],[27,9,30,9],[27,10,30,10],[27,11,30,11],[27,12,30,12],[27,13,30,13]]}
[null,null,null,null,null,null,"Key"]
[null,null,null,null,null,null,"Input"]
[null,null,null,null,null,null,"Calculation"]
[null,null,null,null,null,null,"Information"]
[null,null,null,null,null,null,"Pulled data"]
[]
[]
[null,"Calculator for modelling pellet mill mass balance based on different fuel systems*",null,null,null,null,null,null,"Calculator for determining relative contributions of biomass within a feedstock mixture"]
[]
[null,"Pellet output t",1000,null,null,"Pellet LHV MJ/kgfresh matter",16.86,null,"Tonnes mixture used tfresh matter",null,300]
{"$rows_left_out":33}
{"sheet":"References","index":11,"n_rows":19,"n_cols":9,"rows_kept":19,"cut":false,"hidden":false,"merged":[]}
[]
[]
[]
[]
[]
[]
[]
[null,"#","Reference","Link","Notes"]
[null,1,"JRC (2016); Solid and gaseous bioenergy pathways: input values and GHG emissions - Version 2","http://publications.jrc.ec.europa.eu/repository/bitstream/JRC104759/ld1a27215enn.pdf"]
[null,2,"Biograce II - Version 3","https://www.biograce.net/biograce2/"]
{"$rows_left_out":10}
{"sheet":"Version history","index":12,"n_rows":18,"n_cols":4,"rows_kept":18,"cut":false,"hidden":false,"merged":[[9,1,16,1],[9,2,16,2]]}
[]
[]
[]
[]
[]
[]
[]
[null,"Version number","Date","Changes"]
[null,"V1.0",43739,"Approved calculator following testing, SGS verification against REDII Annex VI methodology and BV review against RO methodology"]
[null,"V2.0",44013,"General\nsimplified formatting\nremoved headings from key"]
{"$rows_left_out":8}